Skip to content
Deployments

Preview#8Failed

Deployment of g1t/security/braces-3.0.3 by g1t via g1t.page,

`docker build --platform linux/amd64 --provenance=false --pull -f '/work/repo/Dockerfile' -t registry.cloudflare.com/1e6f2cffa3f445920836e8ebe446bb58/g1t-todo-app-git-g1t-security-braces-3-0-3-john-peterson-g17:dpl_01m4waz5wgesnr3pg5m4d7wy0y .` failed

Environment
PreviewTransient
Commit
b1c1a01g1t/security/braces-3.0.3
Made by
g1tvia g1t.page
Updated
created

Statuses 3

  1. Queuedg1t ·

    Waiting for a sandbox

    Log

  2. Deployingg1t ·

    Building

    Log

  3. Failedg1t ·

    `docker build --platform linux/amd64 --provenance=false --pull -f '/work/repo/Dockerfile' -t registry.cloudflare.com/1e6f2cffa3f445920836e8ebe446bb58/g1t-todo-app-git-g1t-security-braces-3-0-3-john-peterson-g17:dpl_01m4waz5wgesnr3pg5m4d7wy0y .` failed

    Log

Build on g1t.pageFailed · built in 25 s

`docker build --platform linux/amd64 --provenance=false --pull -f '/work/repo/Dockerfile' -t registry.cloudflare.com/1e6f2cffa3f445920836e8ebe446bb58/g1t-todo-app-git-g1t-security-braces-3-0-3-john-peterson-g17:dpl_01m4waz5wgesnr3pg5m4d7wy0y .` failed

Build log

Building a container from Dockerfile, listening on port 3000.
Docker: started this job's own Docker Engine 29.8.2 in 1.7s. Its containers run in this job's sandbox, on the job's network, and end with the job.
$ docker build --platform linux/amd64 --provenance=false --pull -f '/work/repo/Dockerfile' -t registry.cloudflare.com/1e6f2cffa3f445920836e8ebe446bb58/g1t-todo-app-git-g1t-security-braces-3-0-3-john-peterson-g17:dpl_01m4waz5wgesnr3pg5m4d7wy0y .
#0 building with "default" instance using docker driver

#1 [internal] load build definition from Dockerfile
#1 transferring dockerfile: 191B done
#1 DONE 0.0s

#2 [internal] load metadata for docker.io/library/node:16-alpine
#2 DONE 2.2s

#3 [internal] load .dockerignore
#3 transferring context: 64B done
#3 DONE 0.0s

#4 [internal] load build context
#4 transferring context: 246.74kB 0.0s done
#4 DONE 0.0s

#5 [1/4] FROM docker.io/library/node:16-alpine@sha256:a1f9d027912b58a7c75be7716c97cfbc6d3099f3a97ed84aa490be9dee20e787
#5 resolve docker.io/library/node:16-alpine@sha256:a1f9d027912b58a7c75be7716c97cfbc6d3099f3a97ed84aa490be9dee20e787 0.0s done
#5 sha256:d9059661ce70092af66d2773666584fc8addcb78a2be63f720022f4875577ea9 0B / 452B 0.2s
#5 sha256:eee371b9ce3ffdbb8aa703b9a14d318801ddc3468f096bb6cfeabbeb715147f9 0B / 36.63MB 0.2s
#5 sha256:93b3025fe10392717d06ec0d012a9ffa2039d766a322aac899c6831dd93382c2 0B / 2.34MB 0.2s
#5 sha256:7264a8db6415046d36d16ba98b79778e18accee6ffa71850405994cffa9be7de 0B / 3.40MB 0.2s
#5 sha256:d9059661ce70092af66d2773666584fc8addcb78a2be63f720022f4875577ea9 452B / 452B 0.4s done
#5 sha256:7264a8db6415046d36d16ba98b79778e18accee6ffa71850405994cffa9be7de 1.05MB / 3.40MB 0.9s
#5 sha256:eee371b9ce3ffdbb8aa703b9a14d318801ddc3468f096bb6cfeabbeb715147f9 3.15MB / 36.63MB 1.2s
#5 sha256:93b3025fe10392717d06ec0d012a9ffa2039d766a322aac899c6831dd93382c2 2.34MB / 2.34MB 1.2s
#5 sha256:eee371b9ce3ffdbb8aa703b9a14d318801ddc3468f096bb6cfeabbeb715147f9 12.58MB / 36.63MB 1.4s
#5 sha256:93b3025fe10392717d06ec0d012a9ffa2039d766a322aac899c6831dd93382c2 2.34MB / 2.34MB 1.2s done
#5 sha256:7264a8db6415046d36d16ba98b79778e18accee6ffa71850405994cffa9be7de 3.40MB / 3.40MB 1.2s done
#5 extracting sha256:7264a8db6415046d36d16ba98b79778e18accee6ffa71850405994cffa9be7de
#5 sha256:eee371b9ce3ffdbb8aa703b9a14d318801ddc3468f096bb6cfeabbeb715147f9 29.36MB / 36.63MB 1.5s
#5 extracting sha256:7264a8db6415046d36d16ba98b79778e18accee6ffa71850405994cffa9be7de 0.2s done
#5 sha256:eee371b9ce3ffdbb8aa703b9a14d318801ddc3468f096bb6cfeabbeb715147f9 34.60MB / 36.63MB 1.7s
#5 sha256:eee371b9ce3ffdbb8aa703b9a14d318801ddc3468f096bb6cfeabbeb715147f9 36.63MB / 36.63MB 1.8s
#5 sha256:eee371b9ce3ffdbb8aa703b9a14d318801ddc3468f096bb6cfeabbeb715147f9 36.63MB / 36.63MB 2.9s done
#5 extracting sha256:eee371b9ce3ffdbb8aa703b9a14d318801ddc3468f096bb6cfeabbeb715147f9
#5 extracting sha256:eee371b9ce3ffdbb8aa703b9a14d318801ddc3468f096bb6cfeabbeb715147f9 1.5s done
#5 DONE 4.4s

#5 [1/4] FROM docker.io/library/node:16-alpine@sha256:a1f9d027912b58a7c75be7716c97cfbc6d3099f3a97ed84aa490be9dee20e787
#5 extracting sha256:93b3025fe10392717d06ec0d012a9ffa2039d766a322aac899c6831dd93382c2 0.1s done
#5 extracting sha256:d9059661ce70092af66d2773666584fc8addcb78a2be63f720022f4875577ea9 done
#5 DONE 4.5s

#6 [2/4] WORKDIR /app
#6 DONE 0.3s

#7 [3/4] COPY ./src /app
#7 DONE 0.0s

#8 [4/4] RUN npm install
#8 12.37 npm notice 
#8 12.37 npm notice New major version of npm available! 8.19.4 -> 12.2.0
#8 12.37 npm notice Changelog: <https://github.com/npm/cli/releases/tag/v12.2.0>
#8 12.37 npm notice Run `npm install -g npm@12.2.0` to update!
#8 12.37 npm notice 
#8 12.37 npm ERR! code ECONNRESET
#8 12.37 npm ERR! network aborted
#8 12.37 npm ERR! network This is a problem related to network connectivity.
#8 12.37 npm ERR! network In most cases you are behind a proxy or have bad network settings.
#8 12.37 npm ERR! network 
#8 12.37 npm ERR! network If you are behind a proxy, please make sure that the
#8 12.37 npm ERR! network 'proxy' config is set properly.  See: 'npm help config'
#8 12.38 
#8 12.38 npm ERR! A complete log of this run can be found in:
#8 12.38 npm ERR!     /root/.npm/_logs/2026-10-14T04_33_50_430Z-debug-0.log
#8 ERROR: process "/bin/sh -c npm install" did not complete successfully: exit code: 1
------
 > [4/4] RUN npm install:
12.37 npm ERR! code ECONNRESET
12.37 npm ERR! network aborted
12.37 npm ERR! network This is a problem related to network connectivity.
12.37 npm ERR! network In most cases you are behind a proxy or have bad network settings.
12.37 npm ERR! network 
12.37 npm ERR! network If you are behind a proxy, please make sure that the
12.37 npm ERR! network 'proxy' config is set properly.  See: 'npm help config'
12.38 
12.38 npm ERR! A complete log of this run can be found in:
12.38 npm ERR!     /root/.npm/_logs/2026-10-14T04_33_50_430Z-debug-0.log
------
Dockerfile:7
--------------------
   5 |     COPY ./src /app
   6 |     
   7 | >>> RUN npm install
   8 |     
   9 |     EXPOSE 3000
--------------------
ERROR: failed to build: failed to solve: process "/bin/sh -c npm install" did not complete successfully: exit code: 1
The build failed: `docker build --platform linux/amd64 --provenance=false --pull -f '/work/repo/Dockerfile' -t registry.cloudflare.com/1e6f2cffa3f445920836e8ebe446bb58/g1t-todo-app-git-g1t-security-braces-3-0-3-john-peterson-g17:dpl_01m4waz5wgesnr3pg5m4d7wy0y .` failed